"ID","TIME","NUM_INTERVALS","INT_TIME1","DAYS_SINCE_BL","INT_TIME2","DAYS_SINCE_PREV","PREV_TIME","DEAD","A1","A9","A10","A11A","A11B","A11C","A11D","A11E","A12B","A13","A14A","A14B","A14C","A14D","A14E","A14F","A14G","A14G_T","A15A","A15B","A15C","A16A","A16B","A16C","A17A","A17B","A17C","A17D","A17E","A17F","A17G","A17H","A17I","A17I_T","A18","B1","B2","B3A","B3B","B3C","B3D","B3E","B3F","B3G","B3H","B3I","B3J","B4A","B4B","B4C","B4D","B5A","B5B","B5C","B6","B7","B8","B9A","B9B","B9C","B9D","B9E","B9F","B9G","B9H","B9I","B10","B11A","B11B","B11C","B11D","C1A","C1B","C1C","C1D","C1E","C1F","C1G","C1H","C1I","C1J","C1K","C1L","C1M","C2A1","C2A2","C2B1","C2B2","C2C1","C2C2","C2D1","C2D2","C2E1","C2E2","C2F1","C2F2","C2G1","C2G2","C2H1","C2H2","C2I1","C2I2","C2J1","C2J2","C2K1","C2K2","C2L1","C2L2","C2M1","C2M2","C2N1","C2N2","C2O1","C2O2","C2P1","C2P2","C2Q1","C2Q2","C2R1","C2R2","C2S1","C2S2","C2T1","C2T2","C2U1","C2U2","C2V1","C2V2","C2W1","C2W2","C3A1","C3A2","C3A3","C3B1","C3B2","C3B3","C3C1","C3C2","C3C3","C3D","C3E","C3F1","C3F2","C3F3","C3F_T","C3G1","C3G2","C3G3","C3G4","C3H1","C3H2","C3H3","C3I","C3J","C3K","C3K_M","D1","D2","D3","D4","D5","E2A","E2B","E2C","E3A","E3B","E3C","E4A","E4B","E4C","E5A","E5B","E6","E7A","E7B","E8A1","E8A2","E8A3","E8A4","E9A","E9B","E10A","E10B1","E10B2","E10C19","E11A","E11B","E11C","E12A","E12B","E13","E14A","E14B","E14C","E14D","E14E","E14F","E14G","E15A","E15B","E15C1","E15C2","E15C3","E15C4","E15C5","E15C6","E15C7","E15C8","E15C9","E15C10","E15C11","E15C12","E16A1","E16A2","E16A3","E16A4","E16A5","E16A6","E16A7","E16A8","E16A9","E16A10","E16A11","E16A12","E16A13","E18A","E18B","E18C","E18D","E18F","E18G","E18H","E18I","E18J","E18K","E18L","E18M","F1A","F1B","F1C","F1D","F1E","F1F","F1G","F1H","F1I","F1J","F1K","F1L","F1M","F1N","F1O","F1P","F1Q","F1R","F1S","F1T","G1A","G1A_30","G1B","G1B_30","G1C","G1C_30","G1D","G1D_30","H1_30","H1_LT","H1_RT","H2_30","H2_LT","H2_RT","H3_30","H3_LT","H3_RT","H4_30","H4_LT","H4_RT","H5_30","H5_LT","H5_RT","H6_30","H6_LT","H6_RT","H7_30","H7_LT","H7_RT","H8_30","H8_LT","H8_RT","H9_30","H9_LT","H9_RT","H10_30","H10_LT","H10_RT","H11_30","H11_LT","H11_RT","H12_30","H12_LT","H12_RT","H13_30","H13_LT","H13_RT","H14","H15A","H15B","H16A","H16B","H17A","H17B","H18A","H18B","H19A","H19B","I1","I2","I3","I4","I5","I6A","I6B","I7A","I7B","I8","J1","J2","J3","J4","J5A","J5B","J6","J7","J8","J9","J10A","J10B","K1","K2","K3","L1","L2","L3","L4","L5","L6","L7","L8","L9","L10","L11","L12","L13","L14","L15","L16","L17","L18","L19","L20","L21","L22","L23","L24","L25","M1","M2","M3","M4","M5","M6","M7","M8","M9","M10","M11","M12","M13","M14","M15","M16","M17","M18","M19","M20","M21","M22","M23","M24","M25","M26","M27","M28","M29","M30","M31","M32","M33","M34","M35","M36","M37","M38","M39","M40","M41","M42","M43","M44","M45","M46","M47","M48","M49","M50","N1A","N1B","N1C","N1D","N1E","N1F","N1G","N1H","N1I","N1J","N1K","N1L","N1M","N1N","N2A","N2B","N2C","N2D","N2E","N2F","N2G","N2H","N2I","N2J","N2K","N2L","N2M","N2N","O1A","O1B","O1C","O1D","O2","P1A","P1B","P1C","P2A","P2B","P2C","P3","P4","P5A","P5B","P5C","P6A","P6B","P6C","P7","P8","Q1A","Q1B","Q2","Q3","Q4","Q5","Q6","Q7","Q8","Q9","Q10","Q11","Q12","Q13","Q14","Q15","Q16","Q17","Q18","Q19","Q20","R1A","R1B","R1C","R1D","R1E","R1F","R1G","R1H","R1I","R1J","R1K","R1L","R1M","R1N","R1O","R1P","R1Q","R1R","R1S","S1A","S1B","S1C","S1D","S1E","S1F","T1","T1B","T1C","T2","T2B","T2C","T3","T3B","T3C","U1","U2A","U2B","U2C","U2D","U2E","U2F","U2G","U2H","U2I","U2J","U2K","U2L","U2M","U2N","U2O","U2P","U2Q","U2Q_T","U2R","U3A","U3B","U4","U5","U6A","U6B","PCP_ID","U7A","U7A_T","U8A","U8B","U8C","U8D","U8E","U8F","U10A","U10B","U10C","U11","U12","U13","U14","U15A","U15B","U16A","U16B","U17","U18A","U18B","U19","U20","U21A","U21B","U22A","U22B","U22C","U22D","U22E","U23","U24A","U24B","U24C","U24D","U24E","U25A","U25B","U25C","U25D","U25E","U25F","U25G","U25H","U25I","U26A","U26B","U26C","U26D","U26E","U26F","U26G","U26H","U26I","U27A","U27B","U27C","U27D","U27E","U27F","U27G","U28","U29A","U29B","U29C","U29D","U30","U31","U32A","U32B","U32C","U32D","U32D_T","U33","U34","U35A","U35B","U35C","U35D","U35E","U35F","U36","U37","U38","U39","V1","V2","Z1","Z2","AGE","REALM","E16A_RT","E16A_IB","E16A_TM","E16A_DD","GROUP","MMSEC","PRIM_SUB","SECD_SUB","ALCOHOL","COC_HER","REALM2","REALM3","RACE","RACE2","BIRTHPLC","PRIMLANG","MD_LANG","HS_GRAD","MAR_STAT","A12B_REC","UNEMPLOY","ALONE6M","HOMELESS","JAIL_MOS","JAIL_5YR","GOV_SUPP","A18_REC1","A18_REC2","STD_EVER","STD_6M","CHR_SUM","CHR_EVER","EPI_SUM","EPI_6M","EPI_6M2B","SER_INJ","D3_REC","D4_REC","D5_REC","ANY_INS","FRML_SAT","E10B1_R","E10B2_R","ALT_TRT","ANY_UTIL","NUM_BARR","G1B_REC","G1D_REC","PRIMSUB2","ALCQ_30","H2_PRB","H3_PRB","H4_PRB","H5_PRB","H6_PRB","H7_PRB","H8_PRB","H9_PRB","H10_PRB","H11_PRB","H12_PRB","POLYSUB","SMOKER","O1B_REC","O1C_REC","O1D_REC","O2_REC","PHYABUSE","SEXABUSE","PHSXABUS","ABUSE2","ABUSE3","CURPHYAB","CURSEXAB","CURPHYSEXAB","FAMABUSE","STRABUSE","ABUSE","RAWPF","PF","RAWRP","RP","RAWBP","BP","RAWGH","GH","RAWVT","VT","RAWSF","SF","RAWRE","RE","RAWMH","MH","HT","PCS","MCS","CES_D","CESD_CUT","C_MS","C_AU","C_DU","CUAD_C","CUAD_H","RAW_RE","DEC_RE","RAW_AM","DEC_AM","RAW_TS","DEC_TS","RAW_ADS","PHYS","PHYS2","INTER","INTRA","IMPUL","IMPUL2","SR","CNTRL","INDTOT","INDTOT2","PSS_FR","PSS_FA","DRUGRISK","SEXRISK","TOTALRAB","RABSCALE","CHR_6M","RCT_LINK","REG_MD","ANY_VIS","ANY_VIS_CUMUL","PC_REC","PC_REC7","SATREAT","DRINKSTATUS","DAYSDRINK","ANYSUBSTATUS","DAYSANYSUB","LINKSTATUS","DAYSLINK"
1,0,1,0,,6,,,0,1,9,1,1,0,1,1,1,6,1,0,1,0,1,0,0,0,"",0,0,0,0,0,0,0,0,0,0,,0,0,0,,"",3,3,3,2,3,3,3,3,2,3,3,3,3,0,0,0,1,0,1,1,4,2,2,2,4,3,5,4,4,3,5,2,2,5,2,5,2,0,1,0,0,0,0,0,0,0,0,0,0,0,0,,1,0,0,,0,,0,,0,,0,,0,,0,,0,,0,,0,,0,,0,,1,1,0,,0,,0,,0,,0,,0,,0,,0,,0,,,1,2,0,0,,,0,0,0,,,"",1,3,0,2,,,,,,,,3,0,4,1,4,0,,,0,,,0,,,0,,0,1,18,1,0,0,0,1,3,1,12,0,0,0,,,0,,1,0,0,0,0,0,0,0,0,,,,,,,,,,,,,,1,0,1,0,1,0,0,0,0,0,0,0,0,,,,,,,,,,,,,3,2,3,0,2,3,3,0,2,3,3,0,1,2,2,2,2,3,3,2,1,1,1,1,1,0,1,1,5,29,1,5,20,1,0,0,0,0,0,0,0,0,0,0,0,0,30,2,1,5,10,3,0,0,0,0,12,3,0,5,3,0,0,0,5,20,3,15,0,0,20,600,5,4,2,2,4,4,13,26,,,,0,3,0,30,150,1,1,1,0,0,,,,,,,,1,12,1,2,0,0,0,0,0,0,0,0,0,0,0,0,0,0,1,0,0,0,0,0,0,0,1,0,1,1,1,1,1,1,1,1,1,1,0,1,1,1,1,1,1,1,1,1,1,1,0,1,0,1,1,1,1,1,1,1,1,1,0,1,1,1,1,1,0,0,1,1,0,1,1,0,0,1,7,1,0,0,0,0,0,0,0,1,0,1,0,1,0,0,1,1,0,0,0,0,0,0,0,0,1,1,2,2,2,2,0,1,7,1,1,11,0,2,1,1,11,0,1,11,0,2,1,1,0,0,0,0,2,0,0,0,0,0,0,1,1,0,1,0,1,0,1,4,5,4,5,4,4,3,5,5,5,5,3,5,5,5,4,4,4,5,5,1,0,0,0,0,1,,,,,,,,,,,,,,,,,,,,,,,,,,,,"","",,,,,,,,,"",,,,,,,,,,,,,,,,,,,,,,,,,,,,,,,,,,,,,,,,,,,,,,,,,,,,,,,,,,,,,,,,,,,,,,,,,,,,,,,,,,,,,,,,,37,64,0,0,0,0,1,30,2,1,1,1,2,3,1,2,0,0,0,0,0,1,0,0,0,0,0,,0,15000,1,0,1,1,1,1,1,0,1,1,1,1,1,1,0,0,1,3,1,1,2,65,1,0,0,0,0,1,1,0,1,1,0,1,1,1,1,1,0,1,1,1,3,2,1,0,1,1,1,1,28,90,7,75,9.4,74,21.4,82,13,45,4,25,4,33.3333333333333,15,40,3,58.4136888460348,25.111990058502,49,1,0.461111111111111,0.402527025099775,0.228205128205128,3,0,33,50,14,40,38,80,5,6,6,10,8,8,8,7,2,39,39,0,0,0,4,4,0.1,,,,,,,,0,1,177,1,177,1,225
1,6,1,8.03333333333333,241,8.03333333333333,241,0,0,,,2,1,0,1,1,1,,2,0,1,0,1,0,0,0,"",0,0,0,,,,0,0,0,0,0,0,0,0,0,"",,3,1,2,3,3,2,3,3,3,3,3,3,0,0,0,0,0,0,0,1,1,2,2,5,5,3,2,5,4,3,5,4,5,2,5,2,0,1,0,0,0,0,0,0,0,0,0,0,0,,0,,0,,0,,0,,0,,0,,0,,0,,0,,0,,0,,0,,0,,0,,0,,0,,0,,0,,0,,0,,0,,0,,0,0,,,0,,,0,,,0,0,0,,,"",0,,,,,,,,,,,,0,0,0,0,0,,,0,,,0,,,0,,0,0,,0,0,0,0,1,2,1,0,1,0,0,,,0,,0,0,0,0,0,0,0,0,,,,,,,,,,,,,,,,,,,,,,,,,,,,1,0,0,1,0,0,0,0,0,0,0,0,0,0,0,3,0,0,0,3,0,1,2,3,2,0,0,3,0,1,1,0,0,,0,,0,,1,0,0,,0,0,,0,0,,0,0,,0,0,,0,0,,0,0,,0,0,,0,0,,0,0,,0,0,,0,0,,0,0,,0,,0,0,0,0,0,30,0,1,0,4,,,,,,,,,,,,,,,,,,,,,,,1,10,1,,,,,,,,,,,,,,,,,,,,,,,,,,0,1,0,0,1,0,0,0,0,0,0,1,0,0,0,1,0,0,0,0,0,0,0,0,0,0,0,1,0,0,0,0,0,0,0,1,0,0,0,0,0,0,0,0,0,0,0,0,0,0,1,0,1,1,1,1,1,1,0,0,0,0,1,0,1,1,0,0,7,1,1,1,7,1,1,0,1,0,1,1,1,5,0,,,0,,,0,,,,,0,,,0,,,,0,0,0,0,0,0,0,0,0,0,0,1,2,0,0,0,0,0,1,3,1,1,1,1,4,4,5,5,5,4,2,5,4,5,4,5,4,5,4,0,0,0,0,0,0,1,1,176,0,,,0,,,2,1,0,1,0,1,0,0,0,0,1,0,0,1,0,0,0,0,"","A",0,0,0,1,1,,108,5,"",0,1,,,,,1,1,0,4,3,,5,0,6,0,4,3,,,1,,5,3,5,4,3,3,4,6,3,5,6,5,6,1,1,0,0,1,1,1,1,1,1,1,0,1,0,1,0,0,0,3,4,3,4,3,3,3,5,2,2,2,2,4,0,,,,,,,0,,,,,,,3,,3,3,0,0,0,,,,,,,,1,,,,,,,,,,,,,,,,0,0,0,,,0,,,,0,1,,0,0,0,0,0,0,0,0,0,0,1,0,1,,0,0,,0,0,0,0,0,0,0,0,0,0,0,0,,1,0,0,1,0,,,,,,0,0,0,,,,28,90,8,100,10,80,21.4,82,19,75,9,87.5,6,100,23,72,1,54.2258273618311,52.2347977746607,7,0,0,0,0.173076923076923,,,24,10,12,30,33,50,,0,0,0,4,1,1,0,1,5,5,12,10,0,1,1,0.025,1,1,1,1,1,1,1,0,,,,,,
1,18,2,15.5333333333333,466,7.5,225,6,0,,,1,1,0,1,1,1,,1,0,1,0,1,0,0,0,"",0,0,0,,,,0,0,0,0,0,0,0,0,0,"",,2,1,3,3,3,3,3,3,3,3,3,3,0,0,0,0,0,0,0,1,3,2,2,6,6,2,4,5,4,2,4,5,5,2,5,2,0,0,0,0,0,0,0,0,0,0,0,0,0,,0,,0,,0,,0,,0,,0,,0,,0,,0,,0,,0,,0,,0,,0,,0,,0,,0,,0,,0,,0,,0,,0,,0,0,,,0,,,0,,,0,0,0,,,"",0,,,,,,,,,,,,1,14,1,4,0,,,0,,,0,,,0,,0,0,,0,0,0,0,1,3,1,0,1,0,0,,,0,,0,0,0,0,0,0,0,0,,,,,,,,,,,,,,,,,,,,,,,,,,,,0,0,0,0,0,0,0,0,0,0,1,0,0,0,0,3,2,0,0,3,0,1,2,3,1,0,1,2,0,0,0,0,0,,0,,0,,0,,0,,0,0,,0,0,,0,0,,0,0,,0,0,,0,0,,0,0,,0,0,,0,0,,0,0,,0,0,,0,0,,0,,0,0,0,0,4,4,1,1,4,4,,,,,,,,,,,,,,,,,,,,,,,1,8,1,,,,,,,,,,,,,,,,,,,,,,,,,,0,0,0,0,0,0,0,0,0,0,0,0,0,0,0,0,0,0,0,0,0,0,0,0,0,0,0,0,0,0,0,0,0,0,0,0,0,0,0,0,0,0,0,0,0,0,0,0,0,0,1,0,1,1,1,1,1,1,1,0,1,0,1,0,1,0,1,1,0,0,1,1,0,0,0,0,1,1,1,1,1,5,0,,,0,,,0,,,,,0,,,0,,,,0,0,0,0,0,0,0,0,0,0,0,1,2,0,0,0,0,0,1,4,1,2,1,1,5,3,1,5,5,1,1,1,5,5,5,2,5,5,5,0,0,0,0,0,0,0,,,0,,,0,,,1,1,0,1,0,0,0,0,0,0,0,0,0,0,0,0,0,0,"","A",0,0,0,1,1,,176,5,"",0,1,,,,,1,1,0,5,5,3,3,1,3,1,1,1,4,3,,4,4,6,4,5,5,4,6,6,3,5,5,4,5,1,0,0,0,0,0,0,0,0,1,0,0,0,0,0,0,0,0,3,4,3,3,3,3,3,5,2,2,3,3,4,0,,,,,,,0,,,,,,,2,1,5,4,1,1,0,,,,,,,,1,,,,,,,,,,,,,,,,0,0,0,,,0,,,,0,0,,0,0,0,0,1,1,1,0,0,0,1,0,1,,0,0,,0,0,0,0,0,0,0,0,0,0,0,0,,1,0,0,1,0,,,,,,0,0,0,,,,30,100,8,100,8.2,62,22.4,87,16,60,10,100,6,100,27,88,1,52.0610626612865,56.0600991540516,8,0,0.572222222222222,0.230555555555556,0.106410256410256,,,15,10,8,10,36,70,,0,0,0,0,0,0,0,0,0,0,14,3,0,1,1,0.025,0,1,1,1,2,2,2,0,,,,,,
1,24,1,27.5666666666667,827,12.0333333333333,361,18,0,,,4,1,0,1,1,1,,1,0,1,0,0,0,0,0,"",90,0,0,,,,0,0,0,0,0,0,0,0,0,"",,5,4,3,3,3,3,3,3,2,3,3,3,0,0,0,0,0,0,0,1,2,1,1,5,6,3,2,6,4,1,5,5,5,2,5,2,0,0,0,0,0,0,0,0,0,0,0,0,0,,0,,0,,0,,0,,0,,0,,0,,1,,0,,0,,0,,0,,0,,0,,0,,0,,0,,0,,0,,0,,0,,0,,0,0,,,0,,,0,,,0,0,0,,,"",0,,,,,,,,,,,,0,7,1,4,0,,,0,,,0,,,0,,0,0,,0,0,0,0,1,5,0,,,,1,1,4,0,,0,0,0,0,0,0,0,0,,,,,,,,,,,,,,,,,,,,,,,,,,,,0,0,0,0,0,0,0,0,0,0,0,0,3,1,0,3,0,0,0,3,0,0,1,3,0,0,0,3,0,0,0,0,0,,0,,0,,0,,8,,1,8,,1,0,,0,0,,0,0,,0,0,,0,0,,0,3,,3,0,,0,0,,0,0,,0,0,,0,3,,3,,0,0,60,150,15,15,2,2,4,4,8,8,,,,,,,,120,,,,,,,,,,,,,1,10,1,,,,,,,,,,,,,,,,,,,,,,,,,,0,0,0,0,3,0,1,2,0,2,0,2,2,1,0,3,2,0,0,0,0,1,0,1,0,1,1,3,2,3,2,0,0,0,0,2,2,0,0,1,0,0,0,0,3,0,0,0,0,0,1,0,0,1,1,1,1,1,1,0,1,0,1,0,1,0,0,0,0,1,7,1,1,0,0,0,1,0,2,2,2,4,0,,,0,,,0,,,,,0,,,0,,,,0,0,0,0,0,0,0,0,0,0,0,2,3,0,0,0,0,1,2,4,5,4,5,5,4,4,3,4,5,4,1,4,5,5,4,4,4,4,5,0,0,0,0,1,0,1,,135,0,,,1,,135,1,1,1,1,0,1,0,0,0,0,0,1,0,0,0,0,0,0,"","A",1,1,0,1,0,0,,,"",,,,,,,,,,,,,,,,,,,,,,,,,,,,,,,,,,,,,,,,,,,,,,,,,,,,,,,,,,,,,,,,,,,,,,,,,,,,,,,,,,,,,0,1,999,999,,,,,,,1,,,,,,,,,,,,,,,,0,0,1,,,0,,,,0,0,,1,1,1,0,1,1,1,0,0,0,0,0,1,,0,0,,64,1,0,0,0,0,0,0,0,0,0,0,,1,1,1,1,0,,,,,,0,0,0,,,,29,95,8,100,10.4,84,19,70,20,80,10,100,6,100,27,88,4,52.2728093625806,58.0414279261952,5,0,0.494444444444444,0.515651173680707,0.169230769230769,,,29,30,13,30,37,80,,7,7,9,9,6,6,3,6,34,34,13,7,0,3,3,0.075,0,0,0,0,2,2,2,1,,,,,,
2,0,1,0,,6,,,0,1,12,6,1,0,1,0,1,6,4,1,0,0,0,0,0,0,"",2,3,12,0,0,49,0,0,0,0,0,0,0,0,,"",2,4,4,1,3,3,1,3,1,1,2,3,3,1,1,1,1,1,1,1,1,4,1,6,6,2,6,6,3,3,6,4,1,2,5,1,5,0,1,0,0,0,1,1,0,0,0,0,0,0,0,,1,0,0,,0,,0,,0,,0,,0,,0,,1,1,0,,0,,0,,0,,1,1,0,,1,0,0,,1,0,1,1,1,1,0,,1,1,0,,,0,,,0,,,0,0,0,,,"",1,8,1,2,,,,,,,,22,1,30,0,4,0,,,0,,,0,,,0,,0,0,,0,1,0,0,0,,0,,,,1,1,7,1,1,0,0,0,0,0,0,0,0,0,,,,,,,,,,,,,,1,0,0,1,0,0,0,1,0,0,0,0,0,,,,,,,,,,,,,3,2,0,3,3,2,0,0,3,0,3,0,0,3,0,0,0,2,0,0,1,1,1,0,0,,0,,30,26,1,30,26,1,0,0,0,0,0,0,15,1,1,0,0,0,30,1,1,30,21,3,1,1,1,0,8,3,0,9,1,0,0,0,30,24,3,15,0,0,600,2000,30,0,3,0,3,0,56,62,,,,3,8,12,,500,1,0,1,1,0,,,,,,,,1,20,0,2,0,2,2,0,0,2,0,1,1,2,2,2,0,1,1,2,1,0,0,0,1,2,1,0,1,1,1,1,1,1,1,1,1,1,1,1,1,1,0,1,1,1,1,1,1,1,1,1,1,1,1,1,1,1,1,1,1,1,1,1,1,1,1,1,0,1,1,1,0,1,0,1,1,1,0,1,0,0,0,0,0,0,0,0,0,1,0,1,0,0,1,0,0,0,0,1,0,0,0,0,0,1,5,5,5,1,2,1,5,0,0,,,2,1,0,,,0,,,,,1,0,0,0,0,3,0,0,0,0,0,0,1,1,0,0,0,0,3,4,3,5,1,5,4,1,5,5,4,4,4,1,5,4,5,5,1,5,4,4,0,0,0,0,0,0,,,,,,,,,,,,,,,,,,,,,,,,,,,,"","",,,,,,,,,"",,,,,,,,,,,,,,,,,,,,,,,,,,,,,,,,,,,,,,,,,,,,,,,,,,,,,,,,,,,,,,,,,,,,,,,,,,,,,,,,,,,,,,,,,37,,0,0,0,0,1,26,1,2,1,1,,,2,1,0,0,0,1,1,1,1,1,1,49,1,0,0,7500,0,0,3,1,4,1,1,1,1,0,1,0,0,0,0,0,1,3,0,0,1,1680,1,0,0,1,0,1,1,1,1,1,0,1,1,1,1,0,0,1,0,1,1,1,0,0,0,1,0,1,21,55,4,0,8.1,61,7,10,9,25,6,50,3,0,13,32,4,36.036941655348,26.6703072367353,30,1,0.666666666666667,0.895422612148527,0.271794871794872,3,0,34,60,8,10,30,30,26,8,7,10,8,10,9,7,3,43,41,1,3,0,7,7,0.175,,,,,,,,0,1,2,1,2,,
2,6,1,6.36666666666667,191,6.36666666666667,191,0,0,,,6,1,0,1,0,1,,5,0,0,0,0,0,0,1,"JAIL",1,0,178,,,,0,0,0,0,0,0,0,0,0,"",,3,3,3,3,3,3,3,3,3,3,3,3,0,0,0,0,1,0,0,1,1,1,4,6,5,4,3,3,4,3,4,4,5,5,5,2,0,0,0,0,0,1,0,0,0,0,0,0,0,,0,,0,,0,,0,,0,,0,,0,,0,,0,,0,,0,,0,,0,,0,,0,,0,,0,,0,,0,,0,,0,,0,,0,0,,,0,,,0,,,0,0,0,,,"",1,1,,2,,,,,,,,,1,3,2,0,0,,,0,,,0,,,0,,0,0,,0,0,0,0,1,3,0,,,,0,,,0,,0,0,0,0,0,0,0,0,,,,,,,,,,,,,,,,,,,,,,,,,,,,0,0,0,0,0,1,0,0,0,0,0,1,0,0,0,3,0,0,0,2,2,0,1,2,0,3,0,0,0,0,0,0,0,,0,,0,,0,,5,,1,5,,1,0,,0,0,,0,0,,0,0,,0,0,,0,0,,0,0,,0,0,,0,0,,0,0,,0,0,,0,,0,0,0,0,0,0,0,0,0,0,8,8,,,,,,,,,,,,,,,,,,,,,2,1,0,,,,,,,,,,,,,,,,,,,,,,,,,,1,0,0,0,1,0,0,0,0,0,0,0,0,0,1,0,0,1,1,1,1,1,0,0,0,0,0,0,0,0,0,3,3,0,0,0,0,0,0,0,0,0,0,0,0,0,0,0,0,0,0,1,0,0,0,0,0,0,0,1,0,0,0,0,0,0,1,1,0,0,0,0,0,0,0,0,0,1,5,5,4,1,2,,,0,,,0,,,,,0,,,0,,,,0,0,0,0,0,0,0,0,0,0,0,0,0,0,0,0,0,0,4,4,5,1,5,1,2,2,5,2,2,5,2,5,2,5,5,2,5,2,2,0,0,0,0,0,0,1,1,175,0,,,0,,,2,0,0,0,0,0,0,0,1,0,0,0,0,0,0,0,0,0,"","H",1,1,1,1,,,71,5,"",,,,,4,,0,0,0,6,6,5,5,0,5,1,6,3,5,3,2,2,5,6,5,4,4,5,5,5,5,5,6,5,5,1,1,0,0,0,0,1,1,0,0,0,0,0,0,0,0,0,0,2,3,2,4,2,2,4,10,5,3,4,5,3,0,,,,,,,0,,,,,,,1,2,4,1,1,1,999,999,,,,,,,1,,,,,,,,,,,,,,,,0,0,1,,,0,,,,0,1,,0,0,0,0,1,1,0,0,0,0,0,0,0,,0,0,,40,1,0,0,0,0,0,0,0,0,0,0,,1,1,1,0,0,,,,,,0,0,0,,,,30,100,8,100,12,100,18.4,67,15,55,9,87.5,5,66.6666666666667,21,64,3,59.56065729984,41.7269552797379,11,0,0.2,0.0555555555555556,0,,,35,70,7,10,18,10,,4,4,1,1,5,5,1,2,12,12,2,1,0,0,0,0,1,0,1,0,0,0,0,0,,,,,,
3,0,1,0,,6,,,1,1,12,6,1,0,1,1,1,7,1,0,0,1,0,0,0,0,"",0,0,90,0,0,57,0,0,0,0,0,0,0,0,,"",1,1,4,3,3,3,3,3,3,3,3,3,3,0,0,0,0,1,1,1,4,1,1,4,1,2,6,4,1,2,6,3,2,5,1,5,1,0,0,0,0,0,0,0,0,0,0,0,0,0,0,,0,,0,,0,,0,,0,,0,,0,,0,,0,,0,,0,,0,,0,,0,,0,,0,,0,,0,,0,,0,,0,,0,,0,,,0,,,0,,,0,0,0,,,"",1,2,1,2,,,,,,,,0,0,0,0,0,0,,,0,,,0,,,0,,0,0,,0,0,0,0,1,2,0,,,,0,,,0,,0,0,0,0,0,0,0,0,0,,,,,,,,,,,,,,1,1,1,0,0,0,0,0,0,0,0,0,0,,,,,,,,,,,,,3,2,3,0,2,2,1,3,2,3,1,0,1,3,2,0,0,3,2,0,1,0,0,,0,,0,,0,3,1,0,3,1,16,3,5,0,0,0,0,0,0,0,0,0,10,0,1,0,0,0,0,0,0,0,0,0,0,0,0,0,0,0,10,3,5,16,0,0,0,900,0,30,0,4,0,4,,,10,20,50,,,,,,,,,,,,1,1,1,1,1,1,1,20,1,,,,,,,,,,,,,,,,,,,,,,,,,,1,1,1,1,1,1,1,1,0,0,1,1,1,1,0,1,1,1,1,1,1,1,0,1,0,1,1,1,1,1,1,1,1,1,0,1,1,1,1,1,0,1,1,1,0,1,1,1,1,1,1,0,1,1,1,1,1,1,0,0,1,0,1,0,1,1,0,1,0,0,0,1,0,0,0,0,1,1,3,3,3,3,2,1,3,0,0,,,2,3,0,,,0,,,,,1,1,3,3,1,0,3,3,3,3,0,0,1,2,0,0,0,0,1,1,4,5,5,5,5,5,5,5,5,5,5,5,5,5,5,5,5,5,5,5,0,0,0,0,0,0,,,,,,,,,,,,,,,,,,,,,,,,,,,,"","",,,,,,,,,"",,,,,,,,,,,,,,,,,,,,,,,,,,,,,,,,,,,,,,,,,,,,,,,,,,,,,,,,,,,,,,,,,,,,,,,,,,,,,,,,,,,,,,,,,26,62,0,0,0,0,0,30,3,0,0,1,2,3,1,2,0,0,0,1,1,2,0,0,0,57,1,0,0,2500,0,0,0,0,0,0,0,0,0,0,0,0,0,0,0,0,0,3,0,0,3,0,1,1,0,0,0,1,0,0,0,0,0,1,1,1,1,1,0,1,0,1,1,1,0,0,0,1,0,1,30,100,8,100,12,100,25,100,11,35,4,25,3,0,6,4,4,74.8063299591221,6.76292305238528,39,1,0,0,0.323076923076923,0,6,35,70,20,90,40,90,,8,7,10,8,8,8,7,1,41,40,13,4,20,2,22,0.55,,,,,,,,0,1,3,1,3,0,365
3,6,1,6.36666666666667,191,6.36666666666667,191,0,1,,,6,1,0,1,0,1,,5,0,1,0,0,0,0,1,"JAIL",3,0,110,,,,0,0,0,0,0,0,0,0,0,"",,1,1,3,3,3,3,3,3,3,3,3,3,0,0,0,0,0,0,0,1,1,1,2,6,5,2,1,5,6,2,5,5,4,1,4,1,0,0,0,0,0,0,0,0,0,0,0,0,0,,1,,0,,0,,0,,0,,0,,0,,0,,0,,0,,0,,0,,0,,0,,0,,0,,0,,0,,0,,0,,0,,0,,0,0,,,0,,,0,,,0,0,0,,,"",1,1,,4,,,,,,,,,0,3,0,3,0,,,0,,,0,,,0,,0,0,,0,0,0,0,1,3,0,,,,1,1,2,1,2,0,0,0,0,0,0,0,0,,,,,,,,,,,,,,,,,,,,,,,,,,,,0,0,0,0,0,1,0,0,0,0,0,0,0,2,0,3,0,0,1,3,2,1,1,1,0,1,2,2,0,0,0,1,1,0,0,,0,,0,,0,,0,0,,0,0,,0,0,,0,0,,0,0,,0,0,,0,0,,0,0,,0,2,,3,0,,0,0,,0,0,,0,,0,0,0,0,15,15,3,3,4,4,,,,,,,,,,,,,,,,,,,,,,,3,,,,,,,,,,,,,,,,,,,,,,,,,,,,1,3,3,3,3,3,3,1,0,2,0,3,2,3,0,3,2,3,3,3,1,3,2,1,0,3,3,3,3,3,3,3,3,3,2,3,3,3,3,3,0,3,2,2,0,2,0,0,0,0,0,0,0,0,1,1,0,0,0,0,1,0,0,0,0,0,1,1,0,0,0,0,0,0,0,0,0,1,3,3,3,2,2,,,0,,,0,,,,,0,,,0,,,,1,3,2,3,1,0,2,0,2,0,0,1,3,0,0,0,0,2,2,4,4,1,5,4,4,1,4,5,4,5,1,5,4,5,5,1,5,4,4,0,0,0,0,0,0,1,73,104,1,73,104,1,1,104,1,1,0,1,0,0,0,0,1,0,0,0,0,0,0,0,0,0,"","H",1,1,0,1,0,0,,,"",,,,,,,,,,,,,,,,,,,,,,,,,,,,,,,,,,,,,,,,,,,,,,,,,,,,,,,,,,,,,,,,,,,,,,,,,,,,,,,,,,,,,1,1,999,999,,,,,,,0,,,,,,,,,,,,,,,,0,0,1,,,0,,,,0,0,,1,1,1,0,1,0,1,0,0,0,0,0,1,,0,0,,0,0,0,0,0,0,0,0,0,0,0,0,,0,1,1,1,0,,,,,,0,0,0,,,,30,100,8,100,12,100,23,90,22,90,10,100,6,100,26,84,1,58.4577705332973,56.7713065233917,14,0,0.283333333333333,0.375,0.178205128205128,,,33,50,4,10,34,60,,11,11,25,24,19,17,20,5,99,97,7,1,13,4,17,0.425,0,0,0,0,0,0,0,0,,,,,,
3,24,3,22.2,666,15.8333333333333,475,6,1,,,6,1,0,1,1,1,,1,1,0,0,0,0,0,0,"",0,2,123,,,,0,0,0,0,0,0,0,0,1,"FOOD STAMPS",,3,5,2,2,3,3,3,3,2,3,3,3,0,0,0,0,1,1,1,1,1,1,6,2,3,5,4,2,1,6,2,1,4,2,4,2,0,0,0,0,0,0,0,0,0,0,0,0,0,,0,,0,,0,,0,,0,,0,,0,,0,,0,,0,,0,,0,,0,,0,,0,,0,,0,,0,,0,,0,,0,,0,,0,0,,,0,,,0,,,0,0,0,,,"",0,,,,,,,,,,,,0,0,0,0,1,2,8,1,1,28,1,1,14,0,,0,0,,0,0,0,0,1,5,0,,,,0,,,1,2,1,0,0,0,0,0,0,0,,,,,,,,,,,,,,,,,,,,,,,,,,,,0,0,0,0,1,1,0,1,0,0,0,0,3,3,3,1,3,3,3,0,2,2,3,0,1,2,2,0,1,2,3,2,0,,0,,0,,0,,9,,1,1,,1,26,,5,0,,0,2,,1,0,,0,0,,0,2,,3,0,,0,0,,0,0,,0,0,,0,11,,5,,0,0,25,2000,0,30,0,4,0,4,3,3,9,20,160,,,,,20,,,,,,,,,,,,,1,20,1,,,,,,,,,,,,,,,,,,,,,,,,,,3,3,1,1,2,3,3,2,0,1,1,3,3,3,1,3,3,3,3,2,3,2,0,2,0,3,3,3,3,3,2,1,3,3,0,3,3,3,3,3,0,2,0,2,0,3,0,0,0,0,1,0,1,1,1,1,1,1,0,0,1,0,1,0,1,1,0,0,1,0,1,1,1,1,1,1,0,0,2,1,4,4,1,,,0,,,0,,,,,0,,,0,,,,1,3,3,0,0,3,3,3,3,0,0,1,3,0,0,0,0,3,1,4,5,5,5,5,5,5,5,5,5,5,5,5,5,5,5,5,5,4,5,0,0,0,0,0,0,1,,240,1,,585,1,,585,1,1,0,0,0,0,0,0,1,0,0,0,0,0,0,0,0,1,"NO NEED TO SEE DOCTOR ALTHOUGH","Q",1,1,0,1,1,,,17,"",,,,,,,,,,,,,,,,,,,,,,,,,,,,,,,,,,,,,,,,,,,,,,,,,,,,,,,,,,,,,,,,,,,,,,,,,,,,,,,,,,,,,0,0,999,999,,,,,,,0,,,,,,,,,,,,,,,,0,1,1,,,1,,,,0,0,,0,0,0,0,0,0,0,0,1,0,0,0,1,,0,0,,27,0,1,0,0,0,0,0,0,0,0,0,,1,0,1,1,1,,,,,,0,0,0,,,,27,85,8,100,12,100,19.4,72,7,15,6,50,3,0,10,20,5,66.2438737383714,13.5506511219808,49,1,0,0.129603204146953,0.335897435897436,,,35,70,20,90,39,90,,17,17,24,24,12,12,17,3,94,94,13,13,19,4,23,0.575,0,0,0,0,0,0,0,1,,,,,,
4,0,1,0,,6,,,0,2,11,5,1,1,1,1,0,6,1,0,0,1,0,1,0,0,"",0,0,0,0,0,0,0,0,0,0,0,0,0,0,,"",5,3,3,3,3,3,3,3,3,3,3,3,3,0,0,0,0,1,0,0,2,1,1,2,5,5,5,2,5,5,2,5,4,5,1,5,2,0,0,0,0,0,0,0,0,0,0,0,0,0,0,,0,,0,,0,,0,,0,,0,,1,0,0,,0,,0,,0,,0,,0,,0,,0,,0,,0,,0,,1,0,0,,1,0,0,,0,,,0,,,0,,,0,0,0,,,"",0,,,,1,1,0,1,0,0,,2,0,0,0,0,1,1,8,0,,,0,,,0,,0,0,,0,0,0,0,1,1,0,,,,0,,,0,,0,0,0,0,0,0,0,0,1,1,,,,,,,,,,,,,1,1,1,0,0,0,0,1,0,0,0,0,0,,,,,,,,,,,,,0,0,1,3,2,2,1,3,0,0,1,2,2,2,0,,2,0,0,1,1,1,0,,0,,0,,1,0,0,1,0,0,1,1,2,0,0,0,0,0,0,0,0,0,0,0,0,1,0,0,0,0,0,1,10,3,0,0,0,0,0,0,1,0,3,3,0,0,0,0,0,0,0,0,0,4,5,5,5,5,50,0,0,0,0,,0,0,0,0,0,,0,1,0,0,0,,1,10,1,1,0,0,0,0,0,1,0,0,0,0,0,0,0,0,1,0,0,0,0,0,0,0,0,1,1,1,1,1,0,1,0,1,0,0,0,1,1,1,0,1,1,1,0,0,1,1,0,1,0,1,1,1,1,1,1,0,1,0,0,1,1,1,1,1,0,0,0,0,1,1,0,0,0,0,1,0,7,1,1,1,1,1,1,1,1,7,1,0,1,1,0,0,1,1,1,1,1,1,1,1,0,0,2,3,1,5,2,1,16,0,0,,,2,1,0,,,1,21,0,2,5,0,0,0,0,0,0,0,0,0,0,0,1,0,1,0,0,0,0,3,1,4,5,5,5,5,5,5,4,5,5,5,5,5,5,5,5,5,5,5,5,0,0,0,0,0,0,,,,,,,,,,,,,,,,,,,,,,,,,,,,"","",,,,,,,,,"",,,,,,,,,,,,,,,,,,,,,,,,,,,,,,,,,,,,,,,,,,,,,,,,,,,,,,,,,,,,,,,,,,,,,,,,,,,,,,,,,,,,,,,,,39,48,0,0,0,0,0,23,3,0,0,1,1,2,2,1,1,1,0,0,1,1,0,0,0,0,0,0,1,35000,1,0,0,0,0,0,0,0,0,0,0,0,0,0,0,0,1,4,0,0,3,5,0,1,0,0,0,0,0,0,1,0,0,1,1,1,0,1,0,1,1,1,3,2,0,0,0,1,1,1,30,100,8,100,12,100,22.4,87,20,80,8,75,5,66.6666666666667,22,68,3,61.9316782446832,43.9678811899127,15,0,0,0.0111111111111111,0.0871794871794872,0,1,34,60,20,90,40,90,3,6,6,8,7,2,2,5,1,28,28,11,14,0,4,4,0.1,,,,,,,,1,0,196,1,189,0,343
4,6,1,6.53333333333333,196,6.53333333333333,196,0,0,,,4,1,1,1,0,0,,1,0,0,1,0,0,0,0,"",0,0,0,,,,0,0,0,0,0,0,0,0,0,"",,4,2,3,3,2,2,3,3,3,3,3,3,1,1,1,1,1,1,1,4,4,3,5,2,2,5,6,1,2,5,1,2,4,3,4,4,0,0,0,0,0,0,0,0,0,0,0,0,0,,0,,0,,0,,0,,0,,0,,0,,0,,1,,0,,0,,0,,0,,0,,0,,0,,1,,0,,0,,1,,1,,0,,0,0,,,0,,,0,,,0,0,0,,,"",0,,,,0,,,0,,0,,,0,2,1,1,0,,,0,,,0,,,0,,0,0,,0,0,0,0,1,2,0,,,,1,1,1,1,2,1,0,0,0,0,0,0,0,,,,,,,,,,,,,,,,,,,,,,,,,,,,1,0,0,0,0,0,0,0,1,0,0,0,1,2,2,0,2,2,3,2,3,2,2,1,2,3,3,1,3,3,0,3,1,1,0,,0,,0,,0,,0,0,,0,2,,2,0,,0,0,,0,0,,0,2,,1,0,,0,0,,0,0,,0,0,,0,0,,0,2,,2,,0,1,0,50,0,30,0,4,0,4,,,11,18,40,,,,,,,,,,,,,,,,,,1,10,1,,,,,,,,,,,,,,,,,,,,,,,,,,3,2,2,3,0,1,0,1,0,3,0,3,2,3,0,3,3,3,2,3,2,1,1,3,0,3,3,3,3,3,3,0,3,3,0,3,3,3,3,3,0,0,1,2,1,2,2,1,3,3,1,0,7,1,1,1,1,1,1,1,1,0,1,0,1,1,0,0,1,1,1,1,1,1,1,1,1,0,2,2,2,4,2,,,0,,,0,,,,,0,,,0,,,,0,0,0,0,0,0,0,0,0,0,1,0,1,0,0,0,0,3,1,4,5,4,5,4,4,5,5,4,5,5,4,5,4,4,4,5,4,5,5,0,0,0,0,1,0,0,,,1,1,186,0,,,1,1,1,0,0,0,0,0,1,0,0,1,0,0,0,1,1,0,"","A",0,0,0,1,0,0,,,"",,,,,,,,,,,,,,,,,,,,,,,,,,,,,,,,,,,,,,,,,,,,,,,,,,,,,,,,,,,,,,,,,,,,,,,,,,,,,,,,,,,,,0,0,999,999,,,,,,,0,,,,,,,,,,,,,,,,0,0,0,,,0,,,,0,0,,3,1,1,1,1,1,1,0,0,0,0,0,1,,0,0,,0,0,0,0,0,0,0,0,0,0,0,0,,1,1,1,1,0,,,,,,0,0,0,,,,28,90,4,0,6.1,41,15,50,6,10,4,25,3,0,9,16,2,46.6098770416851,14.6592463951486,44,1,0.188888888888889,0,0.246153846153846,,,33,50,18,80,35,60,,16,15,23,23,18,17,17,1,97,95,12,13,0,4,4,0.1,0,0,0,0,0,0,0,0,,,,,,
4,12,1,11.4333333333333,343,4.9,147,6,0,,,4,1,1,1,1,0,,2,0,0,1,0,0,0,0,"",0,0,0,,,,0,0,0,0,0,0,0,0,0,"",,3,2,2,3,3,3,3,3,3,3,3,3,1,1,0,0,0,1,1,4,2,2,2,1,1,4,2,2,2,3,3,3,4,1,5,4,0,0,0,0,0,0,0,0,0,0,0,0,0,,0,,0,,0,,0,,0,,0,,0,,0,,0,,0,,0,,0,,0,,0,,0,,0,,0,,0,,0,,0,,0,,0,,0,1,1,,0,,,0,,,0,0,0,,,"",1,2,,2,0,,,0,,0,,,0,5,2,4,1,1,4,0,,,1,1,21,0,,0,0,,0,0,0,1,1,2,0,,,,0,,,0,,0,0,0,0,0,0,0,0,,,,,,,,,,,,,,,,,,,,,,,,,,,,1,0,0,0,0,1,0,0,0,0,0,1,,,,,,,,,,,,,,,,,,,,,,,,,,,,,,,,,,,,,,,,,,,,,,,,,,,,,,,,,,,,,,,,,,,,,,,,,,,,,,,,,,,,,,,,,,,,,,,,,,,,,,,,,,,,,,,,,,,,,,,,,,,,,,,,,,,,,,,,,,,,,,,,,,,,,,,,,,,,,,,,,,,,,,,,,,,,,,,,,,,7,7,7,7,7,7,7,7,7,7,7,7,7,7,7,7,7,7,7,7,7,7,7,7,7,7,7,7,,,,,,,,,,,,,,,,,,,,,,,,,,,,,,,,,,,,,,,,,,,,,,,,,,,,,,,,,,,,,,0,0,0,0,1,0,,,,,,,,,,2,1,1,0,0,0,1,0,1,0,0,0,0,0,0,0,1,0,"","H",0,0,1,0,,,82,1,"",,,,,4,,0,0,0,3,5,3,5,0,5,1,3,3,2,5,1,,5,5,4,5,5,6,6,5,5,6,6,6,6,1,1,0,0,1,1,0,1,1,1,0,0,0,1,0,0,1,1,3,4,2,4,1,2,3,6,,,,,,,,,,,,,,,,,,,,,,,,,,999,999,,,,,,,0,,,,,,,,,,,,,,,,0,0,0,,,0,,,,1,0,,1,1,0,0,1,1,1,0,1,0,0,0,1,,,,,,,,,,,,,,,,,,,,,,,,,,,,,,,,,,29,95,6,50,9.4,74,19.4,72,15,55,5,37.5,4,33.3333333333333,11,24,2,57.5609162433134,23.9131627761515,,,0.555555555555556,,,,,,,,,,,,,,,,,,,,,,0,0,,,,,0,0,1,0,0,0,0,0,,,,,,